BDBM50460256 CHEMBL4226751
SMILES Cc1c(C(=O)NCCO)c(CO)nn1-c1cccc2cc(Cc3cccc(c3)C(F)(F)F)sc12
InChI Key InChIKey=ZCGRNQIQUJMSGI-UHFFFAOYSA-N
Data  1 EC50
  Tab Delimited (TSV)   2D SDfile   Computed 3D by Vconf -m prep SDfile
Find this compound or compounds like it in BindingDB:
Activity Spreadsheet -- Enzyme Inhibition Constant Data from BindingDB
Found 1 hit for monomerid = 50460256
TargetG-protein coupled receptor 52(Homo sapiens (Human))
Takeda Pharmaceutical
Curated by ChEMBL
LigandPNGBDBM50460256(CHEMBL4226751)
Affinity DataEC50:  146nM. Assay description: Agonist activity at human GPR52 expressed in CHO cells assessed as increase in cAMP level after 30 mins by AlphaScreen assay
Ligand InfoKEGGPC cidPC sid
In DepthDetails ArticlePubMed